[Solved] No tests found for given includes Error, when running Parameterized Unit test in Android Studio

I tried run Parameterized Unit Test as below in Android Studio.

import android.test.suitebuilder.annotation.SmallTest;  

import junit.framework.TestCase;    

import org.junit.Test;
import org.junit.runner.RunWith;
import org.junit.runners.JUnit4;
import org.junit.runners.Parameterized;
import org.junit.runners.Parameterized.Parameter;
import org.junit.runners.Parameterized.Parameters;  

import java.util.Arrays;
import java.util.Collection;    

@RunWith(Parameterized.class)
@SmallTest
public class FibonacciTest extends TestCase {
    @Parameters
    public static Collection<Object[]> data() {
        return Arrays.asList(new Object[][] {
                {0, 0}, {1, 1}, {2, 1}, {3, 2}, {4, 3}, {5, 5}, {6, 8}
        });
    }   

    @Parameter // first data value (0) is default
    public /* NOT private */ int fInput;    

    @Parameter(value = 1)
    public /* NOT private */ int fExpected; 

    @Test
    public void test() {
        assertEquals(fExpected, Fibonacci.calculate(fInput));
    }
}

The result is error stating No Test Run. However, if I removed the Parameterized, and change them to individual test. It works. Anyone could shed some light why is this not working? Is Parameterized unit test not supported in Android development yet? Thanks!

Below is the error with stack trace.

FAILURE: Build failed with an exception.
* What went wrong:
Execution failed for task ':app:testDebug'.
> No tests found for given includes: [com.example.......FibonacciTest]
* Try:
Run with --info or --debug option to get more log output.
* Exception is:
org.gradle.api.tasks.TaskExecutionException: Execution failed for task ':app:testDebug'.
    at org.gradle.api.internal.tasks.execution.ExecuteActionsTaskExecuter.executeActions(ExecuteActionsTaskExecuter.java:69)
    at org.gradle.api.internal.tasks.execution.ExecuteActionsTaskExecuter.execute(ExecuteActionsTaskExecuter.java:46)
    at org.gradle.api.internal.tasks.execution.PostExecutionAnalysisTaskExecuter.execute(PostExecutionAnalysisTaskExecuter.java:35)
    at org.gradle.api.internal.tasks.execution.SkipUpToDateTaskExecuter.execute(SkipUpToDateTaskExecuter.java:64)
    at org.gradle.api.internal.tasks.execution.ValidatingTaskExecuter.execute(ValidatingTaskExecuter.java:58)
    at org.gradle.api.internal.tasks.execution.SkipEmptySourceFilesTaskExecuter.execute(SkipEmptySourceFilesTaskExecuter.java:42)
    at org.gradle.api.internal.tasks.execution.SkipTaskWithNoActionsExecuter.execute(SkipTaskWithNoActionsExecuter.java:52)
    at org.gradle.api.internal.tasks.execution.SkipOnlyIfTaskExecuter.execute(SkipOnlyIfTaskExecuter.java:53)
    at org.gradle.api.internal.tasks.execution.ExecuteAtMostOnceTaskExecuter.execute(ExecuteAtMostOnceTaskExecuter.java:43)
    at org.gradle.api.internal.AbstractTask.executeWithoutThrowingTaskFailure(AbstractTask.java:310)
    at org.gradle.execution.taskgraph.AbstractTaskPlanExecutor$TaskExecutorWorker.executeTask(AbstractTaskPlanExecutor.java:79)
    at org.gradle.execution.taskgraph.AbstractTaskPlanExecutor$TaskExecutorWorker.processTask(AbstractTaskPlanExecutor.java:63)
    at org.gradle.execution.taskgraph.AbstractTaskPlanExecutor$TaskExecutorWorker.run(AbstractTaskPlanExecutor.java:51)
    at org.gradle.execution.taskgraph.DefaultTaskPlanExecutor.process(DefaultTaskPlanExecutor.java:23)
    at org.gradle.execution.taskgraph.DefaultTaskGraphExecuter.execute(DefaultTaskGraphExecuter.java:88)
    at org.gradle.execution.SelectedTaskExecutionAction.execute(SelectedTaskExecutionAction.java:37)
    at org.gradle.execution.DefaultBuildExecuter.execute(DefaultBuildExecuter.java:62)
    at org.gradle.execution.DefaultBuildExecuter.access$200(DefaultBuildExecuter.java:23)
    at org.gradle.execution.DefaultBuildExecuter$2.proceed(DefaultBuildExecuter.java:68)
    at org.gradle.execution.DryRunBuildExecutionAction.execute(DryRunBuildExecutionAction.java:32)
    at org.gradle.execution.DefaultBuildExecuter.execute(DefaultBuildExecuter.java:62)
    at org.gradle.execution.DefaultBuildExecuter.execute(DefaultBuildExecuter.java:55)
    at org.gradle.initialization.DefaultGradleLauncher.doBuildStages(DefaultGradleLauncher.java:149)
    at org.gradle.initialization.DefaultGradleLauncher.doBuild(DefaultGradleLauncher.java:106)
    at org.gradle.initialization.DefaultGradleLauncher.run(DefaultGradleLauncher.java:86)
    at org.gradle.launcher.exec.InProcessBuildActionExecuter$DefaultBuildController.run(InProcessBuildActionExecuter.java:90)
    at org.gradle.tooling.internal.provider.runner.BuildModelActionRunner.run(BuildModelActionRunner.java:54)
    at org.gradle.launcher.exec.ChainingBuildActionRunner.run(ChainingBuildActionRunner.java:35)
    at org.gradle.launcher.exec.InProcessBuildActionExecuter.execute(InProcessBuildActionExecuter.java:41)
    at org.gradle.launcher.exec.InProcessBuildActionExecuter.execute(InProcessBuildActionExecuter.java:28)
    at org.gradle.launcher.daemon.server.exec.ExecuteBuild.doBuild(ExecuteBuild.java:49)
    at org.gradle.launcher.daemon.server.exec.BuildCommandOnly.execute(BuildCommandOnly.java:36)
    at org.gradle.launcher.daemon.server.api.DaemonCommandExecution.proceed(DaemonCommandExecution.java:120)
    at org.gradle.launcher.daemon.server.exec.WatchForDisconnection.execute(WatchForDisconnection.java:37)
    at org.gradle.launcher.daemon.server.api.DaemonCommandExecution.proceed(DaemonCommandExecution.java:120)
    at org.gradle.launcher.daemon.server.exec.ResetDeprecationLogger.execute(ResetDeprecationLogger.java:26)
    at org.gradle.launcher.daemon.server.api.DaemonCommandExecution.proceed(DaemonCommandExecution.java:120)
    at org.gradle.launcher.daemon.server.exec.RequestStopIfSingleUsedDaemon.execute(RequestStopIfSingleUsedDaemon.java:34)
    at org.gradle.launcher.daemon.server.api.DaemonCommandExecution.proceed(DaemonCommandExecution.java:120)
    at org.gradle.launcher.daemon.server.exec.ForwardClientInput$2.call(ForwardClientInput.java:74)
    at org.gradle.launcher.daemon.server.exec.ForwardClientInput$2.call(ForwardClientInput.java:72)
    at org.gradle.util.Swapper.swap(Swapper.java:38)
    at org.gradle.launcher.daemon.server.exec.ForwardClientInput.execute(ForwardClientInput.java:72)
    at org.gradle.launcher.daemon.server.api.DaemonCommandExecution.proceed(DaemonCommandExecution.java:120)
    at org.gradle.launcher.daemon.server.health.DaemonHealthTracker.execute(DaemonHealthTracker.java:47)
    at org.gradle.launcher.daemon.server.api.DaemonCommandExecution.proceed(DaemonCommandExecution.java:120)
    at org.gradle.launcher.daemon.server.exec.LogToClient.doBuild(LogToClient.java:66)
    at org.gradle.launcher.daemon.server.exec.BuildCommandOnly.execute(BuildCommandOnly.java:36)
    at org.gradle.launcher.daemon.server.api.DaemonCommandExecution.proceed(DaemonCommandExecution.java:120)
    at org.gradle.launcher.daemon.server.exec.EstablishBuildEnvironment.doBuild(EstablishBuildEnvironment.java:71)
    at org.gradle.launcher.daemon.server.exec.BuildCommandOnly.execute(BuildCommandOnly.java:36)
    at org.gradle.launcher.daemon.server.api.DaemonCommandExecution.proceed(DaemonCommandExecution.java:120)
    at org.gradle.launcher.daemon.server.health.HintGCAfterBuild.execute(HintGCAfterBuild.java:41)
    at org.gradle.launcher.daemon.server.api.DaemonCommandExecution.proceed(DaemonCommandExecution.java:120)
    at org.gradle.launcher.daemon.server.exec.StartBuildOrRespondWithBusy$1.run(StartBuildOrRespondWithBusy.java:50)
    at org.gradle.launcher.daemon.server.DaemonStateCoordinator$1.run(DaemonStateCoordinator.java:246)
    at org.gradle.internal.concurrent.ExecutorPolicy$CatchAndRecordFailures.onExecute(ExecutorPolicy.java:54)
    at org.gradle.internal.concurrent.StoppableExecutorImpl$1.run(StoppableExecutorImpl.java:40)
Caused by: org.gradle.api.GradleException: No tests found for given includes: [com.example........FibonacciTest]
    at org.gradle.api.internal.tasks.testing.NoMatchingTestsReporter.afterSuite(NoMatchingTestsReporter.java:35)
    at org.gradle.messaging.dispatch.ReflectionDispatch.dispatch(ReflectionDispatch.java:35)
    at org.gradle.messaging.dispatch.ReflectionDispatch.dispatch(ReflectionDispatch.java:24)
    at org.gradle.internal.event.BroadcastDispatch.dispatch(BroadcastDispatch.java:87)
    at org.gradle.internal.event.BroadcastDispatch.dispatch(BroadcastDispatch.java:31)
    at org.gradle.messaging.dispatch.ProxyDispatchAdapter$DispatchingInvocationHandler.invoke(ProxyDispatchAdapter.java:93)
    at com.sun.proxy.$Proxy46.afterSuite(Unknown Source)
    at org.gradle.api.internal.tasks.testing.results.TestListenerAdapter.completed(TestListenerAdapter.java:48)
    at org.gradle.messaging.dispatch.ReflectionDispatch.dispatch(ReflectionDispatch.java:35)
    at org.gradle.messaging.dispatch.ReflectionDispatch.dispatch(ReflectionDispatch.java:24)
    at org.gradle.internal.event.BroadcastDispatch.dispatch(BroadcastDispatch.java:87)
    at org.gradle.internal.event.BroadcastDispatch.dispatch(BroadcastDispatch.java:31)
    at org.gradle.messaging.dispatch.ProxyDispatchAdapter$DispatchingInvocationHandler.invoke(ProxyDispatchAdapter.java:93)
    at com.sun.proxy.$Proxy45.completed(Unknown Source)
    at org.gradle.api.internal.tasks.testing.results.StateTrackingTestResultProcessor.completed(StateTrackingTestResultProcessor.java:69)
    at org.gradle.api.internal.tasks.testing.results.AttachParentTestResultProcessor.completed(AttachParentTestResultProcessor.java:52)
    at org.gradle.api.internal.tasks.testing.processors.TestMainAction.run(TestMainAction.java:51)
    at org.gradle.api.internal.tasks.testing.detection.DefaultTestExecuter.execute(DefaultTestExecuter.java:75)
    at org.gradle.api.tasks.testing.Test.executeTests(Test.java:527)
    at org.gradle.internal.reflect.JavaMethod.invoke(JavaMethod.java:75)
    at org.gradle.api.internal.project.taskfactory.AnnotationProcessingTaskFactory$StandardTaskAction.doExecute(AnnotationProcessingTaskFactory.java:226)
    at org.gradle.api.internal.project.taskfactory.AnnotationProcessingTaskFactory$StandardTaskAction.execute(AnnotationProcessingTaskFactory.java:219)
    at org.gradle.api.internal.project.taskfactory.AnnotationProcessingTaskFactory$StandardTaskAction.execute(AnnotationProcessingTaskFactory.java:208)
    at org.gradle.api.internal.AbstractTask$TaskActionWrapper.execute(AbstractTask.java:589)
    at org.gradle.api.internal.AbstractTask$TaskActionWrapper.execute(AbstractTask.java:572)
    at org.gradle.api.internal.tasks.execution.ExecuteActionsTaskExecuter.executeAction(ExecuteActionsTaskExecuter.java:80)
    at org.gradle.api.internal.tasks.execution.ExecuteActionsTaskExecuter.executeActions(ExecuteActionsTaskExecuter.java:61)
    ... 57 more
BUILD FAILED
Total time: 4.153 secs
No tests found for given includes: [com.example......FibonacciTest]
Enquirer: Elye

||

Solution #1:

Add to your build.gradle:

test {
    useJUnitPlatform()
}
Respondent: Przemek315

Solution #2:

If you’re using JUnit 5+, make sure you import the @Test annotation from the correct library:

import org.junit.jupiter.api.Test

not

import org.junit.Test

Respondent: LostAtSea

Solution #3:

I am using JUnit 4, and what worked for me is changing the IntelliJ settings for ‘Gradle -> Run Tests Using’ from ‘Gradle (default)’ to ‘IntelliJ IDEA’.

enter image description here

Source of my fix: https://linked2ev.github.io/devsub/2019/09/30/Intellij-junit4-gradle-issue/

Respondent: NobodySomewhere

Solution #4:

To add to already great and easy solution provided by Przemek315, the same config if you use Kotlin DSL:

tasks.test {
    useJUnitPlatform()
}
Respondent: skryvets

Solution #5:

Found a way to run the test in Android Studio. Apparently running it using Gradle Configuration will not execute any test. Instead I use JUnit Configuration. The simple way to do so is go to Select your Test Class to run and Right Click. Then choose Run. After that you’ll see 2 run options. Select the bottom one (JUnit) as per the imageenter image description here

(note: If you can’t find 2 Run Configuration to select, you’ll need to remove your earlier used Configuration (Gradle Configuration) first. That could be done by Clicking on the “Select Run/Debug Configuration” icon in the Top Toolbar.

Respondent: Elye

Solution #6:

If you are using intellij and want to use gradle you need to add this to the dependencies section of build.gradle file:

testImplementation("org.junit.jupiter:junit-jupiter-api:5.4.2")
testRuntimeOnly("org.junit.jupiter:junit-jupiter-engine:5.4.2")
Respondent: SamFisher83

Solution #7:

I made the mistake of defining my test like this

class MyTest {
    @Test
    fun `test name`() = runBlocking {


        // something here that isn't Unit
    }
}

That resulted in runBlocking returning something, which meant that the method wasn’t void and junit didn’t recognize it as a test. That was pretty lame. I explicitly supply a type parameter now to run blocking. It won’t stop the pain or get me my two hours back but it will make sure this doesn’t happen again.

class MyTest {
    @Test
    fun `test name`() = runBlocking<Unit> { // Specify Unit


        // something here that isn't Unit
    }
}
Respondent: Anthony Naddeo

Solution #8:

Kotlin DSL: add to your build.gradle.kts

tasks.withType<Test> {
        useJUnitPlatform()
}

Gradle DSL: add to your build.gradle

test {
    useJUnitPlatform()
}
Respondent: wakedeer

Solution #9:

For me, the cause of the error message

No tests found for given includes

was having inadvertently added a .java test file under my src/test/kotlin test directory. Upon moving the file to the correct directory, src/test/java, the test executed as expected again.

Solution #10:

You could check if your method is private. Spent a lot of time fixing this dumb mistake …

Respondent: mr.M

Solution #11:

Add in build.gradle,

test {
    useJUnitPlatform()
}

and use class org.junit.jupiter.api.Test for @Test, instead of org.junit.Test

Respondent: UserBSS1

Solution #12:

Adding

test {
    useJUnitPlatform()
}

to the top level gave me the error “> Could not find method test() for arguments”. Instead I had to add it to testOptions inside the android block

android {
    ...

    testOptions {
        unitTests.all {
            useJUnitPlatform()
        }
    }
}
Respondent: Sebastian

Solution #13:

In my case, the problem occurred when writing in Kotlin and using IDEA 2020.3. Despite proper entries in build.gradle.kts. It turned out that the problem was when generating test functions by IDEA IDE (Alt + Insert). It generates the following code:

@Test
   internal fun name () {
     TODO ("Not yet implemented")
   }

And the problem will be fixed after removing the “internal” modifier:

@Test
   fun name () {
     TODO ("Not yet implemented")
   }
Respondent: FloatOverflow

Solution #14:

Allow Run tests for all sub-modules using Intellij IDEA by command or UI.

subprojects {
    withType<Test> {
        useJUnitPlatform()
    }
}
Respondent: Braian Coronel

Solution #15:

For JUnit 5, we should use import org.junit.jupiter.api.Test and also should use @ExtendWith instead of @RunWith.

Respondent: Zoey

Solution #16:

I added one string to the gradle build dependency list:

dependencies {
    implementation("org.junit.jupiter:junit-jupiter-params:5.8.0")
    testImplementation(kotlin("test"))
}

Rebuild gradle and everything works.

And remember to add the Test Files:

import org.junit.jupiter.params.ParameterizedTest
Respondent: ????? ???????

Solution #17:

I recently faced this issue and after deep-dive, I got to find out that I was using @Test annotation from junit library. However, my build.gradle file declared another test library.

Therefore, when I used @Test annotation from Test library present in build.gradle then it worked.

Respondent: Anshul Singhal

Solution #18:

I was also facing the same problem. In My case, I am using JUnit 5 with gradle 6.6. I am managing integration test-cases in a separate folder call integ. I have to define a new task in build.gradle file and after adding first line -> useJUnitPlatform() , My problem got solved

Respondent: Ashish Sharma

Solution #19:

In my case I was getting this message due to a runtime error with Junit which wasn’t at all visible from the output of the gradle test task execution. I’ve run into this for a couple reasons:

  1. Including the org.junit.platform:junit-platform-launcher dependency with a version that didn’t match the junit version I was using
  2. Having an entry in META-INF/services for a Junit test listener which I had commented out

You can try re-running with --debug and search for FAILED or org.gradle.api.internal.tasks.testing.TestSuiteExecutionException. In my second case, the exception was:

2020-10-20T11:34:26.517-0700 [DEBUG] [TestEventLogger]
2020-10-20T11:34:26.517-0700 [DEBUG] [TestEventLogger] Gradle Test Executor 1 STARTED
2020-10-20T11:34:26.661-0700 [DEBUG] [TestEventLogger]
2020-10-20T11:34:26.662-0700 [DEBUG] [TestEventLogger] Gradle Test Executor 1 FAILED
2020-10-20T11:34:26.662-0700 [DEBUG] [TestEventLogger]     org.gradle.api.internal.tasks.testing.TestSuiteExecutionException: Could not complete execution for Gradle Test Executor 1.
2020-10-20T11:34:26.662-0700 [DEBUG] [TestEventLogger]         at org.gradle.api.internal.tasks.testing.SuiteTestClassProcessor.stop(SuiteTestClassProcessor.java:63)
2020-10-20T11:34:26.662-0700 [DEBUG] [TestEventLogger]         at sun.reflect.NativeMethodAccessorImpl.invoke0(Native Method)
2020-10-20T11:34:26.662-0700 [DEBUG] [TestEventLogger]         at sun.reflect.NativeMethodAccessorImpl.invoke(NativeMethodAccessorImpl.java:62)
2020-10-20T11:34:26.662-0700 [DEBUG] [TestEventLogger]         at sun.reflect.DelegatingMethodAccessorImpl.invoke(DelegatingMethodAccessorImpl.java:43)
2020-10-20T11:34:26.662-0700 [DEBUG] [TestEventLogger]         at java.lang.reflect.Method.invoke(Method.java:498)
2020-10-20T11:34:26.662-0700 [DEBUG] [TestEventLogger]         at org.gradle.internal.dispatch.ReflectionDispatch.dispatch(ReflectionDispatch.java:36)
2020-10-20T11:34:26.662-0700 [DEBUG] [TestEventLogger]         at org.gradle.internal.dispatch.ReflectionDispatch.dispatch(ReflectionDispatch.java:24)
2020-10-20T11:34:26.662-0700 [DEBUG] [TestEventLogger]         at org.gradle.internal.dispatch.ContextClassLoaderDispatch.dispatch(ContextClassLoaderDispatch.java:33)
2020-10-20T11:34:26.662-0700 [DEBUG] [TestEventLogger]         at org.gradle.internal.dispatch.ProxyDispatchAdapter$DispatchingInvocationHandler.invoke(ProxyDispatchAdapter.java:94)
2020-10-20T11:34:26.662-0700 [DEBUG] [TestEventLogger]         at com.sun.proxy.$Proxy2.stop(Unknown Source)
2020-10-20T11:34:26.662-0700 [DEBUG] [TestEventLogger]         at org.gradle.api.internal.tasks.testing.worker.TestWorker.stop(TestWorker.java:132)
2020-10-20T11:34:26.663-0700 [DEBUG] [TestEventLogger]         at sun.reflect.NativeMethodAccessorImpl.invoke0(Native Method)
2020-10-20T11:34:26.663-0700 [DEBUG] [TestEventLogger]         at sun.reflect.NativeMethodAccessorImpl.invoke(NativeMethodAccessorImpl.java:62)
2020-10-20T11:34:26.663-0700 [DEBUG] [TestEventLogger]         at sun.reflect.DelegatingMethodAccessorImpl.invoke(DelegatingMethodAccessorImpl.java:43)
2020-10-20T11:34:26.663-0700 [DEBUG] [TestEventLogger]         at java.lang.reflect.Method.invoke(Method.java:498)
2020-10-20T11:34:26.663-0700 [DEBUG] [TestEventLogger]         at org.gradle.internal.dispatch.ReflectionDispatch.dispatch(ReflectionDispatch.java:36)
2020-10-20T11:34:26.663-0700 [DEBUG] [TestEventLogger]         at org.gradle.internal.dispatch.ReflectionDispatch.dispatch(ReflectionDispatch.java:24)
2020-10-20T11:34:26.663-0700 [DEBUG] [TestEventLogger]         at org.gradle.internal.remote.internal.hub.MessageHubBackedObjectConnection$DispatchWrapper.dispatch(MessageHubBackedObjectConnection.java:182)
2020-10-20T11:34:26.663-0700 [DEBUG] [TestEventLogger]         at org.gradle.internal.remote.internal.hub.MessageHubBackedObjectConnection$DispatchWrapper.dispatch(MessageHubBackedObjectConnection.java:164)
2020-10-20T11:34:26.663-0700 [DEBUG] [TestEventLogger]         at org.gradle.internal.remote.internal.hub.MessageHub$Handler.run(MessageHub.java:413)
2020-10-20T11:34:26.663-0700 [DEBUG] [TestEventLogger]         at org.gradle.internal.concurrent.ExecutorPolicy$CatchAndRecordFailures.onExecute(ExecutorPolicy.java:64)
2020-10-20T11:34:26.663-0700 [DEBUG] [TestEventLogger]         at org.gradle.internal.concurrent.ManagedExecutorImpl$1.run(ManagedExecutorImpl.java:48)
2020-10-20T11:34:26.663-0700 [DEBUG] [TestEventLogger]         at java.util.concurrent.ThreadPoolExecutor.runWorker(ThreadPoolExecutor.java:1149)
2020-10-20T11:34:26.663-0700 [DEBUG] [TestEventLogger]         at java.util.concurrent.ThreadPoolExecutor$Worker.run(ThreadPoolExecutor.java:624)
2020-10-20T11:34:26.663-0700 [DEBUG] [TestEventLogger]         at org.gradle.internal.concurrent.ThreadFactoryImpl$ManagedThreadRunnable.run(ThreadFactoryImpl.java:56)
2020-10-20T11:34:26.663-0700 [DEBUG] [TestEventLogger]         at java.lang.Thread.run(Thread.java:748)
2020-10-20T11:34:26.663-0700 [DEBUG] [TestEventLogger]
2020-10-20T11:34:26.664-0700 [DEBUG] [TestEventLogger]         Caused by:
2020-10-20T11:34:26.664-0700 [DEBUG] [TestEventLogger]         java.util.ServiceConfigurationError: org.junit.platform.launcher.TestExecutionListener: Provider com.example.myproject.MyCommentedOutClass not found
2020-10-20T11:34:26.664-0700 [DEBUG] [TestEventLogger]             at java.util.ServiceLoader.fail(ServiceLoader.java:239)
2020-10-20T11:34:26.664-0700 [DEBUG] [TestEventLogger]             at java.util.ServiceLoader.access$300(ServiceLoader.java:185)
2020-10-20T11:34:26.664-0700 [DEBUG] [TestEventLogger]             at java.util.ServiceLoader$LazyIterator.nextService(ServiceLoader.java:372)
2020-10-20T11:34:26.664-0700 [DEBUG] [TestEventLogger]             at java.util.ServiceLoader$LazyIterator.next(ServiceLoader.java:404)
2020-10-20T11:34:26.664-0700 [DEBUG] [TestEventLogger]             at java.util.ServiceLoader$1.next(ServiceLoader.java:480)
2020-10-20T11:34:26.664-0700 [DEBUG] [TestEventLogger]             at java.lang.Iterable.forEach(Iterable.java:74)
2020-10-20T11:34:26.664-0700 [DEBUG] [TestEventLogger]             at org.junit.platform.launcher.core.LauncherFactory.create(LauncherFactory.java:94)
2020-10-20T11:34:26.664-0700 [DEBUG] [TestEventLogger]             at org.junit.platform.launcher.core.LauncherFactory.create(LauncherFactory.java:67)
2020-10-20T11:34:26.664-0700 [DEBUG] [TestEventLogger]             at org.gradle.api.internal.tasks.testing.junitplatform.JUnitPlatformTestClassProcessor$CollectAllTestClassesExecutor.processAllTestClasses(JUnitPlatformTestClassProcessor.java:97)
2020-10-20T11:34:26.664-0700 [DEBUG] [TestEventLogger]             at org.gradle.api.internal.tasks.testing.junitplatform.JUnitPlatformTestClassProcessor$CollectAllTestClassesExecutor.access$000(JUnitPlatformTestClassProcessor.java:79)
2020-10-20T11:34:26.664-0700 [DEBUG] [TestEventLogger]             at org.gradle.api.internal.tasks.testing.junitplatform.JUnitPlatformTestClassProcessor.stop(JUnitPlatformTestClassProcessor.java:75)
2020-10-20T11:34:26.664-0700 [DEBUG] [TestEventLogger]             at org.gradle.api.internal.tasks.testing.SuiteTestClassProcessor.stop(SuiteTestClassProcessor.java:61)
2020-10-20T11:34:26.664-0700 [DEBUG] [TestEventLogger]             ... 25 more

Notice that these are DEBUG logs. I didn’t see anything helpful with just --info

Respondent: mowwwalker

Solution #20:

I use @Test annotiation of org.junit.Test package, but I had the same problem. After adding testImplementation("org.assertj:assertj-core:3.10.0") on build.gradle, it worked.

Solution #21:

When I use junit5, it’s working. But every time I execute gradle --clean, I get Class not found error. Then I add this to build.gradle to resolve my problem and I can still use junit4:

test {
}
Respondent: sean_xx

Solution #22:

Steps:

  1. Add platform runner in build.gralde
    => testCompile group: ‘org.junit.platform’, name: ‘junit-platform-runner’, version: ‘1.7.0’
  2. Anotate test class with @RunWith
    => @RunWith(JunitPlatform.class)
Respondent: Ch. Rohit Malik

Solution #23:

For me it worked when I’ve added @EnableJUnit4MigrationSupport class annotation.

(Of course together with already mentioned gradle libs and settings)

Respondent: lsa

Solution #24:

It helps to add: test {useJUnitPlatform()}
but you also need to have recent springBootVersion for me it worked with ‘2.4.5’

Respondent: Nelliczan

Solution #25:

None of the answers worked for me. I needed to add robolectric dependency to resolve this issue.

Respondent: osrl

Solution #26:

I was using a private method. Changing the access modifier to public helped me.

Respondent: Leila F.

Solution #27:

My set up is Android Studio, Junit 4, test with robolectric.

The problem was I added this noverify setting to app level build.gradle in attempt to solve Java.lang.VerifyError: Bad return type from Android Studio run test with code coverage. (https://github.com/robolectric/robolectric/issues/3023)

enter image description here

Removing it fix the problem.

Respondent: BabyishTank

Solution #28:

For anyone that is getting the error: Expression 'test' cannot be invoked as a function when adding the proposed solutions, try instead

tasks.withType<Test> {
    useJUnitPlatform()
}

Works with a KMM setup in 2021.

Respondent: Kevin Bassa

Solution #29:

Just adding… Maybe will help someone else…

In my case, this problem happened because of a case difference in the namespace of the unit test. One letter was upper case instead of lower case (camelCase instead of camelcase).

Respondent: heringer

The answers/resolutions are collected from stackoverflow, are licensed under cc by-sa 2.5 , cc by-sa 3.0 and cc by-sa 4.0 .

Leave a Reply

Your email address will not be published.